{"text_format":"1","workbook":"xlsx","n_sheets":4,"sheets":["HQ Requests","List of HQ Abilities","128","256"],"not_rendered":{"charts":0,"images":0,"macros":1,"external_links":3,"defined_names":628,"comments":0,"pivot_tables":0},"unopened":[],"bounds":{"document_bytes":16777216,"sheet_cells":100000,"rows_first":2000,"rows_last":500,"rows_between":2000,"halvings":0,"cell_chars":16384,"cell_head_chars":4096},"cells_cut":0,"cells_raw":0,"read":"whole","date_system":"1900"}

{"sheet":"HQ Requests","index":0,"n_rows":258,"n_cols":11,"rows_kept":258,"cut":false,"hidden":true,"merged":[[157,0,157,7],[144,0,144,7],[127,0,127,7],[222,0,222,7],[72,0,72,7],[205,0,205,7],[117,0,117,7],[105,0,105,7],[93,0,93,7],[81,0,81,7],[189,0,189,7],[174,0,174,7],[1,0,1,7],[17,0,17,7],[31,0,31,7],[46,0,46,7],[57,0,57,7]]}
["Name","No","Name","Suggestion","Description","Answer","Spend","Is HQ Ability recorded on Existing HQ Ability List?"]
["HQ 20"]
["Camelot",20,"The Opening Move",null,null,null,null,{"$f":"COUNTIF(#REF!,'HQ Requests'!A3)","v":{"$error":"#REF!"}}]
["Hectar",20,"The Opening Move","Function on Zero Power","Function on Zero Power","AGREED",null,{"$f":"COUNTIF(#REF!,'HQ Requests'!A4)","v":{"$error":"#REF!"}}]
["Jannith",20,"The Opening Move","Quick Casting","All Battle Magic spells (1-5) can be cast with one line of vocals.  The one line must be loud, slow and clear - if abused this ability will be removed.","AGREED",null,{"$f":"COUNTIF(#REF!,'HQ Requests'!A5)","v":{"$error":"#REF!"}}]
["Lei Fung",20,"The Opening Move",null,null,null,null,{"$f":"COUNTIF(#REF!,'HQ Requests'!A6)","v":{"$error":"#REF!"}}]
["Myrtle",20,"The Opening Move","Friend of the Earth","Immunity to Bind, Weld, Earthquake, Entrapment, Entombment and Magic Missile 1-8.","Can have either \"Immunity to Magic\" or \"Immunity to Brown Magic\"",null,{"$f":"COUNTIF(#REF!,'HQ Requests'!A7)","v":{"$error":"#REF!"}}]
["Nathan",20,"The Opening Move","Personal Ward","Whilst Meditating or Casting cannot be damaged/broken out.","AGREED",null,{"$f":"COUNTIF(#REF!,'HQ Requests'!A8)","v":{"$error":"#REF!"}}]
["Obelisk",20,"The Opening Move","Strength of the Golem","Can resist 5 Dismembers, 5 bone breaks and 5 location to zero's per day","AGREED",null,{"$f":"COUNTIF(#REF!,'HQ Requests'!A9)","v":{"$error":"#REF!"}}]
["Quicksilver",20,"The Opening Move","Purple Wizard","Must be Purple Mage.  Cast all colours of Magic specialist 1-8.  All schools effectively become primary for 1-8 (gain one Level 6-8 primary only spell per School and all further 6-8 spells cost status as normal).","AGREED",null,{"$f":"COUNTIF(#REF!,'HQ Requests'!A10)","v":{"$error":"#REF!"}}]
["Randolphin",20,"The Opening Move","Purple Mage","Must have all 8 colours of Magic. Cast all colours of Magic specialist 1-5 (specialist spells gained with no status).  All schools effectively become primary for 1-5 (further spells cost status as normal).","AGREED",null,{"$f":"COUNTIF(#REF!,'HQ Requests'!A11)","v":{"$error":"#REF!"}}]
["Shard",20,"The Opening Move","Invocation Support","Must already have Invocation Guard Status 128 ability for this to work.  The caster is no longer considered to be \"out\" power and may regain it as normal through rest.  All Invocations are cast as normal and take the required power, but all power may be recovered, even from active invocations.  Can never start an event having already benefitted from this - will be \"out\" the normal amount of power at start of event, as if just cast everything.","AGREED",null,{"$f":"COUNTIF(#REF!,'HQ Requests'!A12)","v":{"$error":"#REF!"}}]
["Spark",20,"The Opening Move","Dodge","3 x a day can dodge a complete blow that you can normally use dexterity against (i.e. would be able to completely dodge \"Oct Cause Mortal Bonebreak\").  A suitable in character call should be used to demonstrate that you are immune, along the lines \"By my power I dodge that\".","AGREED",null,{"$f":"COUNTIF(#REF!,'HQ Requests'!A13)","v":{"$error":"#REF!"}}]
["Tersius",20,"The Opening Move","Magical Weapon","Grows his own weapon which becomes an extension of him.  Weapon is sentient and can only be wielded by Tersius (others gain no effect). Weapon is immune to Vanish and if destroyed by other means needs to be cured (role playing).  Weapon does plus one damage of all types, which stacks with everything.  Always has a base of Single, Magic One, Power One.  Can only have Magic or Power on it at one time.","AGREED",null,{"$f":"COUNTIF(#REF!,'HQ Requests'!A14)","v":{"$error":"#REF!"}}]
["Toshiro",20,"The Opening Move","Damage Resist","Can resist Bone Break, Dismember, Disarm and Location to Zero, 3 of each per day. A suitable in character call should be used to demonstrate that you are immune, along the lines \"By my power I resist that\".","AGREED",null,{"$f":"COUNTIF(#REF!,'HQ Requests'!A15)","v":{"$error":"#REF!"}}]
["Verrick",20,"The Opening Move","Vocal Length","Can cast each of the following Invocations at Vocal Length, once each per day: Heal, Double Strength, Protection from Death Rank 8.","AGREED",null,{"$f":"COUNTIF(#REF!,'HQ Requests'!A16)","v":{"$error":"#REF!"}}]
["Woolf",20,"The Opening Move","Permanent Good Spirit","Good Spirit Heal.  Activates on zero life. Once per day. ","AGREED",null,{"$f":"COUNTIF(#REF!,'HQ Requests'!A17)","v":{"$error":"#REF!"}}]
["HQ 21 Into the Jaws of Darkness"]
["Brother John",21,"Into the Jaws of Darkness","Spiritual Cleansing","  Through the force of his spirit, Brother John can remove any influence, possession, enbodyment, seed, beguiling insfluence, sprirtual influence etc. from another player. This will be done by good role playing.","AGREED","YES",{"$f":"COUNTIF(#REF!,'HQ Requests'!A19)","v":{"$error":"#REF!"}}]
["Delta",21,"Into the Jaws of Darkness","Ki Healer","Must have Ki access.  Use Ki to cast the following invocations: Cure Blindness, Cure Fatal Disease, Heal, Neutralise Poison, Regenerate.  Do not need to learn these Invocations separately, they come as part of the ability.","AGREED","Rcd 100",{"$f":"COUNTIF(#REF!,'HQ Requests'!A20)","v":{"$error":"#REF!"}}]
["Giles",21,"Into the Jaws of Darkness","Purple Sorceror","Must be Purple Wizard.  Cast all colours of Magic specialist 1-10.  All schools effectively become primary for 1-10 (gain one Level 9 primary only spell per School and all further 9-10 spells cost status as normal).","AGREED","YES",{"$f":"COUNTIF(#REF!,'HQ Requests'!A21)","v":{"$error":"#REF!"}}]
["Harry",21,"Into the Jaws of Darkness","Embody Humacti Spirit","Once per day, for one encounter ( 1 hour max. ), be immune to the following effects if received from an undead - fear, paralysis, terror, powerdrain, disease, possession, beguilement, bonebreak. These will be resisted with an in character shout of \"By the  power of Humact, I resist thee..\" ( or something similar)","AGREED","YES",{"$f":"COUNTIF(#REF!,'HQ Requests'!A22)","v":{"$error":"#REF!"}}]
["Hectar",21,"Into the Jaws of Darkness",null,null,null,"YES",{"$f":"COUNTIF(#REF!,'HQ Requests'!A23)","v":{"$error":"#REF!"}}]
["Jharkor",21,"Into the Jaws of Darkness","Resist Invocation","Resist 1no. Touch of Evil 6-8, and 5 occurances total, of the following invocations per day - powerdrain, terror, powerhammer, cause mortal, cause major disease.","AGREED","YES",{"$f":"COUNTIF(#REF!,'HQ Requests'!A24)","v":{"$error":"#REF!"}}]
["Maggot",21,"Into the Jaws of Darkness","Shroud-Master of Ushaz","Whilst having and Evil Sphere invoke running, may cast Shroud of Ushaz, Rank 7, at Vocal length, once per Invoke.","AGREED","YES",{"$f":"COUNTIF(#REF!,'HQ Requests'!A25)","v":{"$error":"#REF!"}}]
["Randolphin",21,"Into the Jaws of Darkness","Stauts Spend","Yellow School of Magic","AGREED","YES",{"$f":"COUNTIF(#REF!,'HQ Requests'!A26)","v":{"$error":"#REF!"}}]
["Sky",21,"Into the Jaws of Darkness","Tempestial Oblivion","1 Vocal length 5, 6, or 7 per day. Destroy magic item Once per day, with a 15 minute role playing Ritual - Non Combat.","AGREED","YES",{"$f":"COUNTIF(#REF!,'HQ Requests'!A27)","v":{"$error":"#REF!"}}]
["Slurry",21,"Into the Jaws of Darkness","Die Hard","Can stabilise from death without the need for tending.  Player Referee will indicate at battleboard if dead or how long it will take to stabilise and recover - does not mean you are unkillable, just means that you will know at the battleboard if you should roleplay a lingering death, or if you are going to recover.  When recover, return on 1 Life per location.","AGREED","YES",{"$f":"COUNTIF(#REF!,'HQ Requests'!A28)","v":{"$error":"#REF!"}}]
["Spark",21,"Into the Jaws of Darkness","Skill Spend","Elven Warrior","AGREED","YES",{"$f":"COUNTIF(#REF!,'HQ Requests'!A29)","v":{"$error":"#REF!"}}]
["Wolf",21,"Into the Jaws of Darkness","Function on Zero Power","Function on Zero Power","AGREED","YES",{"$f":"COUNTIF(#REF!,'HQ Requests'!A30)","v":{"$error":"#REF!"}}]
["Wraith",21,"Into the Jaws of Darkness","Double Meditate","Meditate Twice per day. ","AGREED","YES",{"$f":"COUNTIF(#REF!,'HQ Requests'!A31)","v":{"$error":"#REF!"}}]
["HQ 22 - Agoth"]
["Aruna",22,"Agoth","Resist Evil","The first 3 evil invocations cast on you per day, from the following list (Beguilement, Cause Wounds, Greater Curse, Cause Disease, Powerdrain, Touch of Evil), are lowered by one effective rank/stage.  A suitable in character call should be used to demonstrate that you are immune, along the lines \"By my power I resist that\".","AGREED",null,{"$f":"COUNTIF(#REF!,'HQ Requests'!A33)","v":{"$error":"#REF!"}}]
["Ezekiel Bramble",22,"Agoth","Necrologists Lore","Ability to Discern Undead any where (even PoSD) at any range, no Power cost. Also able to personally affect any undead with any damage Ezekial is doing personally, eg. Zeke using Weapn of Disruption would be doing 5 damage per blow to ANY undead.\"","AGREED",null,{"$f":"COUNTIF(#REF!,'HQ Requests'!A34)","v":{"$error":"#REF!"}}]
["Jack",22,"Agoth","The Spirit of Jack","Once per event, Jack, and after his permanent death, the nominated party leader, may lead a song, in which all participating party members gather around an appropriate tree / bush, hold hands and sing the Song of Jack. They will all gain a 2 point Obscurement for 1 hour. ","AGREED",null,{"$f":"COUNTIF(#REF!,'HQ Requests'!A35)","v":{"$error":"#REF!"}}]
["Kal",22,"Agoth","Invocation Support","Must already have Invocation Guard Status 128 ability for this to work.  The caster is no longer considered to be \"out\" power and may regain it as normal through rest.  All Invocations are cast as normal and take the required power, but all power may be recovered, even from active invocations.  Can never start an event having already benefitted from this - will be \"out\" the normal amount of power at start of event, as if just cast everything.","AGREED",null,{"$f":"COUNTIF(#REF!,'HQ Requests'!A36)","v":{"$error":"#REF!"}}]
["Kalliste",22,"Agoth","Damage Resist","Can resist Bone Break, Dismember, Disarm and Location to Zero, 3 of each per day. A suitable in character call should be used to demonstrate that you are immune, along the lines \"By my power I resist that\".","AGREED",null,{"$f":"COUNTIF(#REF!,'HQ Requests'!A37)","v":{"$error":"#REF!"}}]
["Kevralyn",22,"Agoth","Immuntiy to Evil Sphere","Once a day immune to all Evil Sphere Invocations for 15 minutes (not weapons).  A suitable in character call should be used to demonstrate that you are immune, along the lines \"By my power I resist that\".","AGREED",null,{"$f":"COUNTIF(#REF!,'HQ Requests'!A38)","v":{"$error":"#REF!"}}]
["Khortaz",22,"Agoth","Status Spend","Micheline","AGREED",null,{"$f":"COUNTIF(#REF!,'HQ Requests'!A39)","v":{"$error":"#REF!"}}]
["Lancorrin",22,"Agoth","New Ki Shout","Cost 0 Ki, usable unlimited times per day, resist pain effect / spell / invocation / blow",null,null,{"$f":"COUNTIF(#REF!,'HQ Requests'!A40)","v":{"$error":"#REF!"}}]
{"$rows_left_out":219}
{"sheet":"List of HQ Abilities","index":1,"n_rows":134,"n_cols":3,"rows_kept":134,"cut":false,"hidden":false,"merged":[[0,0,0,1]]}
["When you are granted the title of Hero (normally by attending a Heroquest) then you become eligible to choose one of the abilities below.  You may only choose one ability and must meet any pre requisites.  A Hero ability does not cost any points or status, unless stated otherwise. Once you have decided which ability you wish you should discuss this with the Heroquest Admin who will confirm your ability and ensure that you fully understand what it means.  You may not trade in Hero abilities once chosen (unless approved by HQ Admin) or swap them as you gain status. \n\nIf you wish an ability that is not on this list then you should submit your suggestion to HQ Admin.  \n\nWe reserve the right to alter any given ability or skill, or to change the wording, or to remove it entirely if we feel it proves to be unclear or unbalancing.",null,"Max Picks"]
["AC Bastion","All AC equals the same as the highest 3 x day for one encounter.",2]
["AC Increase - Physical","All allies with you gain plus one Physical AC .  Three times a day can increase own Physical AC by 5 for one encounter.",2]
["AC Increase - Magical","All allies with you gain plus one Magic AC.  Three times a day can increase own MAC to 20 for one encounter.",2]
["Affinity to Earth","Sanctuary of Earth spells last one extra duration \"step\" - counts as in element for 30 minutes a day, split as wished.",1]
["Battle Caster","May cast self only spells/invocations with a weapon and shield in hands.",1]
["Battle Magic Master","3 x day can upgrade Prot Battle Magic 8 to protect against spells of levels 1-8 for one encounter.",1]
["Become Elemental","Immune to Good and Evil Sphere, no spirit (innate power).  Should call \"No affect\" when using this skill.",1]
["Become Stone Troll","Immune to the Good Sphere.  Plus 4 physical A.C. Regenerate 1 point of life per minute.",1]
["Become Werewolf","Three times per day can assume the form of a werewolf for a 5 minute period.  During this time the following effects apply -  minimum damage from weapon blows,  +1 physical strength to a maximum of quad strength (applied to weapon damage as normal), Silver Weapons do normal damage.",1]
["Black Market Merchant","All items on the Marketplace cost half price (cannot purchase for others).",1]
["Bladebind","Weapon cannot be taken from player against their will - neither by strength, fumble or disarm.",1]
["Blessing of Good Sphere","Plus 1 PAC to non evil casters & +1 PAC if Sworn to King.",1]
["Blood Letting","May let (own) blood 3 times per event.  Effects last for whole event.  Any who drink the blood of Fenrir may gain one of the following -  plus 1 physical damage, plus 2 physical armour or plus 50 HP (per day). Players may only benefit from drinking once per event each. ",1]
["Bloodlines","To be able to use life as power in an emergency - a straight one for one.  Any life used in this way cannot be regained until after a night's sleep.",1]
["Body Pump","Gains 100 temporary life points 3 x per day. These can’t be cured and last for 1 encounter or until used (whichever is sooner).",2]
["Class Upgrade","Within your Primary Class, you may upgrade 2 Secondary Guilds to Primary Membership, and gain 1 status to spend with each Guild. If this is your 3rd taking of this ability, you may upgrade 3 Secondary Guilds to Primary Membership and gain 1 Status to spend in each Guild.",3]
["Combat Awareness Increase","Increase Combat Awareness by one step.",3]
["Creature of Darkness","+1 Strength & Resistance to blindness while in darkness.",1]
["Damage Assimilation ","Can take onto yourself  damage incurred by other characters. can choose 5 uses per section, 10 uses per day or all for one encounter per day.  A suitable in character call should be used to demonstrate that you are taking the damage, along the lines \"By my power I take that for you\".",2]
["Damage Increase (Ki)","Can Ki up power and magic damage similar to physical.\nAvailable to Monks only.",1]
["Damage Increase (Magic) ","Magically attune to weapon to do one plus magic damage.","no limit"]
["Damage Increase (Physical)","Physically attune to weapon to do one plus physical damage.","no limit"]
["Damage Increase (Power) ","Spiritually attune to weapon to do plus one power damage","no limit"]
["Damage Resist","Can resist Bone Break, Dismember, Disarm and Location to Zero, 3 of each per day. A suitable in character call should be used to demonstrate that you are immune, along the lines \"By my power I resist that\".",1]
["Damage Resist - Undead","3 x per day can avoid any damage done by undead.",1]
["Damage Master - Caster","One damaging spell or invocation (must choose one only and agree with HQ Admin) does any of the following damage type (blunt, sharp, wood, silver, magic and power); damage must be specified by caster on release of invocation/spell.",2]
["Damage Master - Weapon","Able to change damage type from Physical to Magic or Power. May do Magic or Power damage equal to half of physical damage (rounded down) as an addition to the empowerment or Ensorcellment of the weapon being used. Takes 5 minutes to change from one damage type to another.",1]
["Disguise Mastery","For each disguise (one status cost) may respend one third of existing points and status on skills for new disguise.  Cannot choose specialist spells/invocation.",1]
["Disinformation","Can give any answer to discern, recognise or detect skills/invocations.",1]
["Dodge","3 x a day can dodge absolutely anything you wish, touch attack, range or blow, with the exception of the following effects - Neuro Cosmic Flare, Mind Lock, Mind Stun, Psi Bolt, Attract Good / Neutral / Evil / Living / Undead,  Befriend, Domination, Paranoia, Possession, Beguilement, Fear, Terror. You may not Dodge if Paralysed.  A suitable in character call should be used to demonstrate that you are immune, along the lines \" By my power I Dodge that\". \nThis ability may only be taken once.",1]
["Double Meditate","Meditate Twice per day.  Need separate HQA for different meds - Power, Ki, Adrenal, Psi etc.",4]
["Double Mnemonic","Can Mnemonic back double your rank in mana.",1]
["Embers of Destruction","May use a \"warrior resist\" to destroy a level 5 or below spell targeting or in effect on the bearer only.  Once per section this may be enhanced to destroy an incoming level 8 spell in the same manner.",1]
["Endurance Mastery","Can Stack Endurances on each other, from purchased slots only.",1]
["Enhanced Courage  ","Can Remove Fear on others for zero power, by touch only (a gentle shake and roleplaying giving the individual courage - no more than 10 seconds).",1]
["Enhanced Disguise Mastery","For each disguise mastered may re-spend one third of existing hero abilities on abilities for new disguise.\nMust have Disguise Mastery.",1]
["Enhanced Field Surgery","Can heal anything through surgery - referee discretion.  Requires the use of a surgery kit and roleplaying and does not cost any power.",1]
["Espionage","Once per day you may attempt to gather information via secretive operatives in the field. You will need to provide a written request of the information you are seeking, and this should be secretly passed to one of the referee team. As protection from counter espionage operatives, you will be permanently under the effect of a Concealment.",1]
["Evil Fire","Ten times a day can add any Rank 1-5 evil invocation that caster knows onto one of their Blades at no power cost. It will stay on the blade until discharged",1]
{"$rows_left_out":95}
{"sheet":"128","index":2,"n_rows":14,"n_cols":3,"rows_kept":14,"cut":false,"hidden":true,"merged":[[13,0,13,2]]}
["Ability","Description","Points Cost"]
["Adrenal Dexterity Increase","Must be able to use Adrenals first.  Can cast Adrenals Dexterity 6-8.","as per table"]
["Increased Combat Awareness","Increase Combat Awareness by one level (max AC 20). Must have Combat Awareness Enhanced Mastery First",50]
["Invocation Guard","This ability guards any Invocations cast by you, so that if you die, the Invocations will not fail and therefore do not have to be re-cast.  You will remain power out as normal.",0]
["Limit Raise (Dex)","Unarmoured Dex limit raised to 20. ",0]
["Limit Raise (Dex)","Armoured Dex limit raised to 12. ",0]
["Limit Raise (Ki)","Able to use up to 8 Ki vs Power, Magic or Damage, to resist 6-8; three times per day. Must be able to cast Level/Rank in order to Kai off. Ki Damage limit rasied to Oct.",0]
["Limit Raise (Spell/Invocation)","Spell or Invocation damage limit raised to Oct. ","as table"]
["Power Store","Gain an item of 15 point power store per day.  One power store only allowed.",50]
["Specialist Sect Access (Acolyte)","Access to (name) Sect invocations 1-5.  Still costs status as normal to actually obtain any Invocations.",0]
["Specialist Sect Access (Priest)","Access to (name) Sect invocations 1-8.  Must have Specialist Sect Access (Acolyte). Still costs status as normal to actually obtain any Invocations.",0]
["Spell Store","Store (self only) - A level 7 Skin (any type) and Dispel 8 are stored in the casters body - one each per day (must be able to cast Skin and Dispel - the caster will be \"out\" a level 7 and 8 slot as per normal store rules).  Released with \"Mana I release thee\".  This store is allowed in addition to any other Spell stores that a Wizard/Sorcerer may have.",0]
[]
["When you reach Rank 128 (1280 points) you become eligible to choose new skills from the above Status Skills list.  Each skill chosen costs one point of status and the points indicated and you may choose multiple skills, providing you spend the status.  You must meet any pre-requisites.  If you take one of these skills you should record it on your battleboard - if you need assistance to do this, contact HQ Admin. You may not trade in skills once chosen or swap them as you gain status.  We reserve the right to alter any given ability or skill, or to change the wording, if we feel it proves to be unclear or unbalancing."]

{"sheet":"256","index":3,"n_rows":18,"n_cols":3,"rows_kept":18,"cut":false,"hidden":true,"merged":[[1,0,1,2],[17,0,17,2]]}
["Ability","Description","Points Cost"]
["(see notes below)"]
["Cast through Weapon","Can cast one named invocation/spell 2-5 through weapon - normal vocals, delivered by weapon.",0]
["Damage Increase "," Damage with all weapons increased by one rank (max Nov).  Available to primary Warriors only.",50]
["Extra Arcane Preparation","Instead of being able to cast one Sorcerers Store, may be able to cast two - still costs two spell slots.",0]
["Greater Invoke","New Rank 8 Invocation.  Costs 10 power and takes 10 minutes to cast. Within the nextfollowing 15 minutes can cast two vocal length 6-8 of named Sphere. If Evil, one of these must be Shroud of Ushaz.",0]
["High Priest","Be granted rights of High Priest when not normally available.",0]
["In Touch with Sphere","Can straight cast all Ritual Invocations in 10 minutes with the standard rules applying for casting Ritual Power, or 5 minutes with a Good Ritual and Vocals.",0]
["Limit Raise (Life)","New limit max 300 Life.  Available to Warrior table only - Scouts may choose either Life, Mana or Power.","as table"]
["Limit Raise (Mana)","New limit max 700 Mana.  Available to Mage table only - Scouts may choose either Life, Mana or Power.","as table"]
["Limit Raise (Power)","New limit max 300 Power.  Available to Acolyte table only - Scouts may choose either Life, Mana or Power.","as table"]
["Limit Raise (Ki)","New limit max 300 Ki. Available to Scout table only.","as table"]
["Power Store","Upgrade 15 point power store item to a 30 point power store item.  One power store only allowed.",50]
["Recast Spell Store","Can recast (name) Store on events.",0]
["Recharge (Persistant spell)","All active Arcane spells previously cast (Frostweaver, Arcane Skins, Sorcerers & Wizards Dispel, Frozen Storm, Embody Elemental of Ice, Embody Elemental of Lightning, Tempest, Entombment, Stone Crafter, Fusilade of Flame, Strength Stealer), automatically recharge the next morning (after sleep), unless Dispelled - self only.",0]
["Sorcerer","Be granted rights of Sorcerer when not normally available.",0]
[]
["When you reach Rank 256 (2560 points) you become eligible to choose new skills from the above Status Skills list.  Each skill chosen costs one point of status and the points indicated and you may choose multiple skills, providing you spend the status.  You must meet any pre-requisites.  If you take one of these skills you should record it on your battleboard - if you need assistance to do this, contact HQ Admin. You may not trade in skills once chosen or swap them as you gain status.  We reserve the right to alter any given ability or skill, or to change the wording, if we feel it proves to be unclear or unbalancing."]